{"text_format":"2","workbook":"xlsx","n_sheets":3,"sheets":["Sheet1","Sheet2","Sheet3"],"not_rendered":{"charts":0,"images":0,"macros":0,"external_links":0,"defined_names":3,"comments":0,"pivot_tables":0},"unopened":[],"bounds":{"document_bytes":16777216,"sheet_cells":100000,"run_cost":"one","rows_first":2000,"rows_last":500,"rows_between":2000,"halvings":0,"cell_chars":16384,"cell_head_chars":4096},"cells_cut":0,"cells_raw":0,"read":"whole","date_system":"1900"}

{"sheet":"Sheet1","index":0,"n_rows":1370,"n_cols":14,"rows_kept":1370,"cut":false,"hidden":false,"merged":[]}
[]
[]
[null,null,null,"2022-03-17T09:54:00"]
[]
[null,null,null,"1363 objects"]
[]
[null,null,null,"BOM Line","Item Name","Item Id","Revision","Quantity","Find No.","LOCATOR","REMARKS","Item Revision Definition Configuration Used","Level","Category"]
[null,null,null,"00JP89ZZ/00.03;1-KTM DUKE 400 ABS (Design)","KTM DUKE 400 ABS","00JP89ZZ",0.03,{"$nulls":5},0,"AS (Assembly,Sub-Assy)"]
[null,null,null,"JP113855/00.00;1-ASSEMBLY SCHEME FRAME (Design) x 1","ASSEMBLY SCHEME FRAME","JP113855",0,1,10,null,null,null,1,"AS (Assembly,Sub-Assy)"]
[null,null,null,"JP111189/00.00;1-ASSEMBLY FRAME (Design) x 1","ASSEMBLY FRAME","JP111189",0,1,10,null,null,null,2,"AS (Assembly,Sub-Assy)"]
[null,null,null,"JP111113/00.07;1-FRAME ASSEMBLY FRONT (Design) x 1","FRAME ASSEMBLY FRONT","JP111113",7.0000000000000007E-2,1,10,null,null,null,3,"SM (Sheet Metal & Fabricated Parts)"]
[null,null,null,"JP111131/00.00;1-TUBE HEAD (Design) x 1","TUBE HEAD","JP111131",0,1,10,"CHASSIS-FRAME",null,null,4,"TU (Tubes)"]
[null,null,null,"DK161146/02;1-PIPE FRAME HEAD x 1","PIPE FRAME HEAD","DK161146",2,1,10,"CHASSIS-FRAME",null,null,5,"SM (Sheet Metal & Fabricated Parts)"]
[null,null,null,"JP111144/00.00;1-STOPPER STEERING x 1","STOPPER STEERING","JP111144",0,1,20,"CHASSIS-FRAME",null,null,5,"SM (Sheet Metal & Fabricated Parts)"]
[null,null,null,"JP111166/00.00;1-BRACKET IMMOBILISER x 1","BRACKET COVER FRAME FRONT","JP111166",0,1,30,"CHASSIS-FRAME",null,null,5,"SM (Sheet Metal & Fabricated Parts)"]
[null,null,null,"JP111132/00.01;1-TUBE UPPER LH x 1","TUBE UPPER LH","JP111132",0.01,1,20,"CHASSIS-FRAME",null,null,4,"TU (Tubes)"]
[null,null,null,"JP111133/00.00;1-TUBE UPPER RH x 1","TUBE UPPER RH","JP111133",0,1,30,"CHASSIS-FRAME",null,null,4,"TU (Tubes)"]
[null,null,null,"JP111134/00.01;1-TUBE LOWER LH x 1","TUBE LOWER LH","JP111134",0.01,1,40,"CHASSIS-FRAME",null,null,4,"TU (Tubes)"]
[null,null,null,"JP111135/00.02;1-TUBE LOWER RH x 1","TUBE LOWER RH","JP111135",0.02,1,50,"CHASSIS-FRAME",null,null,4,"TU (Tubes)"]
[null,null,null,"JP111136/00.00;1-TUBE CROSS FRONT LH I x 1","TUBE CROSS FRONT LH I","JP111136",0,1,70,"CHASSIS-FRAME",null,null,4,"TU (Tubes)"]
[null,null,null,"JP111137/00.00;1-TUBE CROSS FRONT RH I x 1","TUBE CROSS FRONT RH I","JP111137",0,1,80,"CHASSIS-FRAME",null,null,4,"TU (Tubes)"]
[null,null,null,"JP111138/00.00;1-TUBE CROSS FRONT LH II x 1","TUBE CROSS FRONT LH II","JP111138",0,1,90,"CHASSIS-FRAME",null,null,4,"TU (Tubes)"]
[null,null,null,"JP111139/00.00;1-TUBE CROSS FRONT RH II x 1","TUBE CROSS FRONT RH II","JP111139",0,1,100,"CHASSIS-FRAME",null,null,4,"TU (Tubes)"]
[null,null,null,"JP111140/00.00;1-TUBE CROSS FRONT LH III x 1","TUBE CROSS FRONT LH III","JP111140",0,1,110,"CHASSIS-FRAME",null,null,4,"TU (Tubes)"]
[null,null,null,"JP111141/00.00;1-TUBE CROSS FRONT RH III x 1","TUBE CROSS FRONT RH III","JP111141",0,1,120,"CHASSIS-FRAME",null,null,4,"TU (Tubes)"]
[null,null,null,"JP111142/00.00;1-TUBE CROSS FRONT LH IV x 1","TUBE CROSS FRONT LH IV","JP111142",0,1,130,"CHASSIS-FRAME",null,null,4,"TU (Tubes)"]
[null,null,null,"JP111143/00.00;1-TUBE CROSS FRONT RH IV x 1","TUBE CROSS FRONT RH IV","JP111143",0,1,140,"CHASSIS-FRAME",null,null,4,"TU (Tubes)"]
[null,null,null,"JP111145/00.00;1-TUBE CROSS UPPER x 1","TUBE CROSS UPPER","JP111145",0,1,150,"CHASSIS-FRAME",null,null,4,"TU (Tubes)"]
[null,null,null,"JP111146/00.00;1-GUSSET TUBE HEAD UPPER (Design) x 1","GUSSET TUBE HEAD UPPER","JP111146",0,1,160,"CHASSIS-FRAME",null,null,4,"SM (Sheet Metal & Fabricated Parts)"]
[null,null,null,"KCMB0605/01;1-NUT WELD SQUARE x 1","NUT WELD SQUARE","KCMB0605",1,1,10,"CHASSIS-FRAME",null,null,5,"HW (Hardware includes nuts,washers)"]
[null,null,null,"JP111147/00.01;1-GUSSET TUBE HEAD LOWER (Design) x 1","GUSSET TUBE HEAD LOWER","JP111147",0.01,1,170,"CHASSIS-FRAME",null,null,4,"SM (Sheet Metal & Fabricated Parts)"]
[null,null,null,"JP111148/00;1-BRACKET RADIATOR TOP (UGDesignView) x 1","BRACKET RADIATOR TOP","JP111148",0,1,10,"CHASSIS-FRAME",null,null,5,"SM (Sheet Metal & Fabricated Parts)"]
[null,null,null,"JP111149/00.02;1-BRACKET TANK FRONT (Design) x 1","BRACKET TANK FRONT","JP111149",0.02,1,180,"CHASSIS-FRAME",null,null,4,"SM (Sheet Metal & Fabricated Parts)"]
[null,null,null,"JP111183/00;1-COLLAR x 2","COLLAR","JP111183",0,2,10,"CHASSIS-FRAME",null,null,5,"BA (Bar or Turned components)"]
[null,null,null,"KCMB0605/01;1-NUT WELD SQUARE x 2","NUT WELD SQUARE","KCMB0605",1,2,20,"CHASSIS-FRAME",null,null,5,"HW (Hardware includes nuts,washers)"]
[null,null,null,"JP111178/00.00;1-BRACKET PIPE DUCT INTAKE FR LH x 1","BRACKET DUCT INTAKE FR LH","JP111178",0,1,190,"CHASSIS-FRAME",null,null,4,"SM (Sheet Metal & Fabricated Parts)"]
[null,null,null,"JP111150/00.01;1-BRACKET HARNESS x 1","BRACKET HARNESS","JP111150",0.01,1,200,"CHASSIS-FRAME",null,null,4,"SM (Sheet Metal & Fabricated Parts)"]
[null,null,null,"JP111151/00.00;1-BRACKET UNIT REGULATOR (Design) x 1","BRACKET UNIT REGULATOR","JP111151",0,1,210,"CHASSIS-FRAME",null,null,4,"SM (Sheet Metal & Fabricated Parts)"]
[null,null,null,"KCMB0605/01;1-NUT WELD SQUARE x 2","NUT WELD SQUARE","KCMB0605",1,2,10,"CHASSIS-FRAME",null,null,5,"HW (Hardware includes nuts,washers)"]
[null,null,null,"JG111085/02;1-BRACKET EARTHING LATCH (Design) x 1","BRACKET EARTHING LATCH","JG111085",2,1,230,"CHASSIS-FRAME",null,null,4,"SM (Sheet Metal & Fabricated Parts)"]
{"$rows_left_out":1331}
{"sheet":"Sheet2","index":1,"n_rows":113,"n_cols":12,"rows_kept":113,"cut":false,"hidden":false,"merged":[]}
["BOM Line","Item Name","Item Id","Revision","Quantity","Find No.","LOCATOR","REMARKS","Item Revision Definition Configuration Used","Level","Category"]
["30191017/04;1-NUT ROUND M8X1.25 (Design) x 1","NUT ROUND M8X1.25",30191017,4,1,90,"CONTROLS-CONTROL LEVER & PEDAL",null,null,3,"HW (Hardware includes nuts,washers)",{"$f":"VLOOKUP(C2,Sheet3!$A$2:$A$87,1,0)","v":{"$error":"#N/A"}}]
["39118415/05;1-NUT NYLOC M5X0.8 x 1","NUT NYLOC M5X0.8",39118415,5,1,80,"CONTROLS-CONTROL LEVER & PEDAL",null,null,3,"HW (Hardware includes nuts,washers)",{"$f":"VLOOKUP(C3,Sheet3!$A$2:$A$87,1,0)","v":{"$error":"#N/A"}}]
["39167504/00;1-BOLT FLANGED M6X28 x 2","BOLT FLANGED M6X28",39167504,0,2,100,"ELECTRICAL/ELECTRONICS VEHICLE-REGULATOR,RECTIFIER,CDI, FLASHER",null,null,3,"HW (Hardware includes nuts,washers)",{"$f":"VLOOKUP(C4,Sheet3!$A$2:$A$87,1,0)","v":39167504}]
["DH101389/02;1-BOLT SOCKET-M6X1XL 20XCL 12.9 (Design) x 1","BOLT SOCKET-M6X1XL 20XCL 12.9","DH101389",2,1,1050,"ENGINE ASSEMBLY-ENGINE ASSEMBLY",null,null,3,"HW (Hardware includes nuts,washers)",{"$f":"VLOOKUP(C5,Sheet3!$A$2:$A$87,1,0)","v":{"$error":"#N/A"}}]
["DK101284/05;1-BOLT SOCKET-M5X0.8XL 34XPRECOAT x 3","BOLT SOCKET-M5X0.8XL 34XPRECOAT","DK101284",5,3,810,"ENGINE ASSEMBLY-ENGINE ASSEMBLY",null,null,3,"HW (Hardware includes nuts,washers)",{"$f":"VLOOKUP(C6,Sheet3!$A$2:$A$87,1,0)","v":{"$error":"#N/A"}}]
["DK101386/03;1-BOLT SOCKET M8X1 (Design) x 1","BOLT SOCKET M8X1","DK101386",3,1,30,"ACCESSORIES-GUARD",null,null,3,"HW (Hardware includes nuts,washers)",{"$f":"VLOOKUP(C7,Sheet3!$A$2:$A$87,1,0)","v":"DK101386"}]
["JG113207/01;1-BOLT x 1","BOLT","JG113207",1,1,40,"CHASSIS-STAND",null,null,3,"HW (Hardware includes nuts,washers)",{"$f":"VLOOKUP(C8,Sheet3!$A$2:$A$87,1,0)","v":"JG113207"}]
["JG113837/01;1-BOLT FLANGED M6X1 x 2","BOLT FLANGED M6X1","JG113837",1,2,40,"EXHAUST SYSTEM-DEFAULT",null,null,3,"HW (Hardware includes nuts,washers)",{"$f":"VLOOKUP(C9,Sheet3!$A$2:$A$87,1,0)","v":"JG113837"}]
["JG181250/01;1-BOLT FLANGED STEP M6X1 x 1","BOLT FLANGED STEP M6X1","JG181250",1,1,200,"COOLING SYSTEM-RADIATOR",null,null,3,"HW (Hardware includes nuts,washers)",{"$f":"VLOOKUP(C10,Sheet3!$A$2:$A$87,1,0)","v":"JG181250"}]
["JG181255/01;1-BOLT FLANGED STEP M6X1 x 1","BOLT FLANGED STEP M6X1","JG181255",1,1,110,"COOLING SYSTEM-RADIATOR",null,null,3,"HW (Hardware includes nuts,washers)",{"$f":"VLOOKUP(C11,Sheet3!$A$2:$A$87,1,0)","v":"JG181255"}]
["JG511022/00;1-BOLT SPECIAL (Design) x 4","BOLT SPECIAL","JG511022",0,4,210,"ENGINE ASSEMBLY-ENGINE ASSEMBLY",null,null,3,"HW (Hardware includes nuts,washers)",{"$f":"VLOOKUP(C12,Sheet3!$A$2:$A$87,1,0)","v":{"$error":"#N/A"}}]
["JG511270/01;1-BOLT FLANGED M6X1 (Design) x 1","BOLT FLANGED M6X1","JG511270",1,1,260,"ENGINE ASSEMBLY-ENGINE ASSEMBLY",null,null,3,"HW (Hardware includes nuts,washers)",{"$f":"VLOOKUP(C13,Sheet3!$A$2:$A$87,1,0)","v":{"$error":"#N/A"}}]
["JG601005/03;1-DOME NUT (Design) x 1","DOME NUT","JG601005",3,1,860,"ENGINE ASSEMBLY-ENGINE ASSEMBLY",null,null,3,"HW (Hardware includes nuts,washers)",{"$f":"VLOOKUP(C14,Sheet3!$A$2:$A$87,1,0)","v":{"$error":"#N/A"}}]
["JP122060/00.01;1-SHAFT ARM SWING x 1","SHAFT ARM SWING","JP122060",0.01,1,90,"SUSPENSION-REAR SUSPENSION",null,null,3,"HW (Hardware includes nuts,washers)",{"$f":"VLOOKUP(C15,Sheet3!$A$2:$A$87,1,0)","v":"JP122060"}]
["JR113803/00.00;1-BOLT SPECIAL M5 X 14L x 4","SCREW BUTTON HEAD STEP M5X0.8","JR113803",0,4,210,null,null,null,3,"HW (Hardware includes nuts,washers)",{"$f":"VLOOKUP(C16,Sheet3!$A$2:$A$87,1,0)","v":{"$error":"#N/A"}}]
["JY113025/00;1-BOLT CHANGE LEVER (Design) x 1","BOLT CHANGE LEVER","JY113025",0,1,30,"CHASSIS-FOOTREST",null,null,3,"HW (Hardware includes nuts,washers)",{"$f":"VLOOKUP(C17,Sheet3!$A$2:$A$87,1,0)","v":{"$error":"#N/A"}}]
["JY113821/04;1-SCREW BUTTON HEAD-M6X1XL12XBLACK x 6","SCREW BUTTON HEAD-M6X1XL12XBLACK","JY113821",4,6,80,"PANEL AND TRIM-COVER",null,null,3,"HW (Hardware includes nuts,washers)",{"$f":"VLOOKUP(C18,Sheet3!$A$2:$A$87,1,0)","v":"JY113821"}]
["JY121011/02;1-BOLT SOCKET-M8X1.25XL30XCL8.8XBL x 2","BOLT SOCKET-M8X1.25XL30XCL8.8XBL","JY121011",2,2,160,"STEERING-HANDLE BAR/ STEERING COLUMN",null,null,2,"HW (Hardware includes nuts,washers)",{"$f":"VLOOKUP(C19,Sheet3!$A$2:$A$87,1,0)","v":"JY121011"}]
["JY151011/03;1-BOLT FLANGED-M16X1.5XL33XPRECOAT x 1","BOLT FLANGED M16X1.5","JY151011",3,1,170,"STEERING-HANDLE BAR/ STEERING COLUMN",null,null,2,"HW (Hardware includes nuts,washers)",{"$f":"VLOOKUP(C20,Sheet3!$A$2:$A$87,1,0)","v":"JY151011"}]
["JY541019/00;2-RETAINER GEAR STARTER (Design) x 1","RETAINER GEAR STARTER","JY541019",0,1,540,"ENGINE ASSEMBLY-ENGINE ASSEMBLY",null,null,3,"HW (Hardware includes nuts,washers)",{"$f":"VLOOKUP(C21,Sheet3!$A$2:$A$87,1,0)","v":{"$error":"#N/A"}}]
["KACA0614/01;1-BOLT SOCKET x 4","BOLT SOCKET M6X1","KACA0614",1,4,80,"CHASSIS-ENGINE MOUNTING",null,null,3,"HW (Hardware includes nuts,washers)",{"$f":"VLOOKUP(C22,Sheet3!$A$2:$A$87,1,0)","v":"KACA0614"}]
["KACA0616/01;1-BOLT Socket head M6X1 x 1","BOLT SOCKET M6X1","KACA0616",1,1,90,"PANEL AND TRIM-COVER",null,null,3,"HW (Hardware includes nuts,washers)",{"$f":"VLOOKUP(C23,Sheet3!$A$2:$A$87,1,0)","v":"KACA0616"}]
["KACA0625/02;1-BOLT SOCKET M6X1 x 1","BOLT SOCKET M6X1","KACA0625",2,1,130,"CHASSIS-FOOTREST",null,null,3,"HW (Hardware includes nuts,washers)",{"$f":"VLOOKUP(C24,Sheet3!$A$2:$A$87,1,0)","v":{"$error":"#N/A"}}]
["KACA0820/01;1-Bolt-Socket-KAC ST-A Dia-08 L-20 x 4","BOLT SOCKET M8X1.25","KACA0820",1,4,50,"CHASSIS-ENGINE MOUNTING",null,null,3,"HW (Hardware includes nuts,washers)",{"$f":"VLOOKUP(C25,Sheet3!$A$2:$A$87,1,0)","v":"KACA0820"}]
["KACA0825/01;1-Bolt-Socket-KAC ST-A Dia-08 L-25 x 4","BOLT SOCKET M8X1.25","KACA0825",1,4,90,"CHASSIS-ENGINE MOUNTING",null,null,3,"HW (Hardware includes nuts,washers)",{"$f":"VLOOKUP(C26,Sheet3!$A$2:$A$87,1,0)","v":"KACA0825"}]
["KACF0610/02;1-BOLT SOCKET M6X1 x 2","BOLT SOCKET M6X1","KACF0610",2,2,70,"INTAKE SYSTEM-AIR FILTER",null,null,3,"HW (Hardware includes nuts,washers)",{"$f":"VLOOKUP(C27,Sheet3!$A$2:$A$87,1,0)","v":"KACF0610"}]
["KACF0612/01;1-BOLT SOCKET M6X1 x 2","BOLT SOCKET M6X1","KACF0612",1,2,170,null,null,null,3,"HW (Hardware includes nuts,washers)",{"$f":"VLOOKUP(C28,Sheet3!$A$2:$A$87,1,0)","v":{"$error":"#N/A"}}]
["KACJ0655/00;1-BOLT SOCKET-M6X1XL55XCL8.8XBLACK x 2","BOLT SOCKET M6X1","KACJ0655",0,2,150,"STEERING-HANDLE BAR/ STEERING COLUMN",null,null,2,"HW (Hardware includes nuts,washers)",{"$f":"VLOOKUP(C29,Sheet3!$A$2:$A$87,1,0)","v":"KACJ0655"}]
["KADA0512/01;1-BOLT FLANGED M5X0.8 x 4","BOLT FLANGED M5X0.8","KADA0512",1,4,20,"ELECTRICAL/ELECTRONICS VEHICLE-LIGHTS",null,null,3,"HW (Hardware includes nuts,washers)",{"$f":"VLOOKUP(C30,Sheet3!$A$2:$A$87,1,0)","v":"KADA0512"}]
["KADA0612/01;1-BOLT FLANGED M6X1 x 1","BOLT FLANGED M6X1","KADA0612",1,1,130,"CHASSIS-FRAME FITTINGS",null,null,3,"HW (Hardware includes nuts,washers)",{"$f":"VLOOKUP(C31,Sheet3!$A$2:$A$87,1,0)","v":"KADA0612"}]
["KADA0614/01;1-BOLT FLANGED M6X1 x 4","BOLT FLANGED M6X1","KADA0614",1,4,20,"PANEL AND TRIM-FENDER & FLAP",null,null,3,"HW (Hardware includes nuts,washers)",{"$f":"VLOOKUP(C32,Sheet3!$A$2:$A$87,1,0)","v":"KADA0614"}]
["KADA1030/01;1-BOLT FLANGED M10X1.25 x 2","BOLT FLANGED M10X1.25","KADA1030",1,2,30,"CHASSIS-FRAME FITTINGS",null,null,3,"HW (Hardware includes nuts,washers)",{"$f":"VLOOKUP(C33,Sheet3!$A$2:$A$87,1,0)","v":{"$error":"#N/A"}}]
["KADD0525/00;1-BOLT FLANGED M5X0.8 x 3","BOLT FLANGED M5X0.8","KADD0525",0,3,1420,"LUBRICATION SYSTEM-OIL PUMP",null,null,3,"HW (Hardware includes nuts,washers)",{"$f":"VLOOKUP(C34,Sheet3!$A$2:$A$87,1,0)","v":{"$error":"#N/A"}}]
["KADD0610/01;1-BOLT FLANGED M6X1 x 3","BOLT FLANGED M6X1","KADD0610",1,3,170,"COOLING SYSTEM-RADIATOR",null,null,3,"HW (Hardware includes nuts,washers)",{"$f":"VLOOKUP(C35,Sheet3!$A$2:$A$87,1,0)","v":"KADD0610"}]
["KADD0612/01;1-BOLT FLANGED M6X1 x 1","BOLT FLANGED M6X1","KADD0612",1,1,130,null,null,null,3,"HW (Hardware includes nuts,washers)",{"$f":"VLOOKUP(C36,Sheet3!$A$2:$A$87,1,0)","v":"KADD0612"}]
["KADD0622/01;1-BOLT FLANGED M6X1 x 2","BOLT FLANGED M6X1","KADD0622",1,2,1490,"ELECTRICAL/ELECTRONICS ENGINE-STARTER MOTOR",null,null,3,"HW (Hardware includes nuts,washers)",{"$f":"VLOOKUP(C37,Sheet3!$A$2:$A$87,1,0)","v":{"$error":"#N/A"}}]
["KADD0625/01;1-BOLT FLANGED M6X1 x 2","BOLT FLANGED M6X1","KADD0625",1,2,40,"COOLING SYSTEM-RADIATOR",null,null,3,"HW (Hardware includes nuts,washers)",{"$f":"VLOOKUP(C38,Sheet3!$A$2:$A$87,1,0)","v":"KADD0625"}]
["KADD0690/00;1-BOLT FLANGED M6X1 x 1","BOLT FLANGED M6X1","KADD0690",0,1,120,"FUEL SYSTEM-FUEL TANK",null,null,3,"HW (Hardware includes nuts,washers)",{"$f":"VLOOKUP(C39,Sheet3!$A$2:$A$87,1,0)","v":"KADD0690"}]
["KADD0814/01;1-BOLT FLANGED M8X1.25 x 1","BOLT FLANGED M8X1.25","KADD0814",1,1,20,"ELECTRICAL/ELECTRONICS VEHICLE-HORN",null,null,3,"HW (Hardware includes nuts,washers)",{"$f":"VLOOKUP(C40,Sheet3!$A$2:$A$87,1,0)","v":"KADD0814"}]
{"$rows_left_out":74}
{"sheet":"Sheet3","index":2,"n_rows":87,"n_cols":3,"rows_kept":87,"cut":false,"hidden":false,"merged":[]}
["ITEM NO.","MOD"]
["LAC00200",0,{"$f":"VLOOKUP(A2,Sheet2!C66:$C$113,1,0)","v":"LAC00200"}]
["LAC00201",0,{"$f":"VLOOKUP(A3,Sheet2!C67:$C$113,1,0)","v":"LAC00201"}]
["LBU00148",0,{"$f":"VLOOKUP(A4,Sheet2!C$113:$C121,1,0)","v":{"$error":"#N/A"}}]
["LAA00007",0,{"$f":"VLOOKUP(A5,Sheet2!C97:$C$113,1,0)","v":{"$error":"#N/A"}}]
["LBU00158",0,{"$f":"VLOOKUP(A6,Sheet2!C96:$C$113,1,0)","v":"LBU00158"}]
["LCG00003",2,{"$f":"VLOOKUP(A7,Sheet2!C37:$C$113,1,0)","v":"LCG00003"}]
["JP122060",0.01,{"$f":"VLOOKUP(A8,Sheet2!C38:$C$113,1,0)","v":{"$error":"#N/A"}}]
["LCG00019",0,{"$f":"VLOOKUP(A9,Sheet2!C105:$C$113,1,0)","v":"LCG00019"}]
["LBU00050",2,{"$f":"VLOOKUP(A10,Sheet2!C$113:$C120,1,0)","v":{"$error":"#N/A"}}]
["LBU00082",1,{"$f":"VLOOKUP(A11,Sheet2!C52:$C$113,1,0)","v":{"$error":"#N/A"}}]
["LAC00111",0,{"$f":"VLOOKUP(A12,Sheet2!C58:$C$113,1,0)","v":"LAC00111"}]
["LCH00001",1,{"$f":"VLOOKUP(A13,Sheet2!C49:$C$113,1,0)","v":"LCH00001"}]
["JY121011",2,{"$f":"VLOOKUP(A14,Sheet2!C14:$C$113,1,0)","v":"JY121011"}]
["LAC00004",3,{"$f":"VLOOKUP(A15,Sheet2!C41:$C$113,1,0)","v":"LAC00004"}]
["KACJ0655",0,{"$f":"VLOOKUP(A16,Sheet2!C42:$C$113,1,0)","v":{"$error":"#N/A"}}]
["JY151011",3,{"$f":"VLOOKUP(A17,Sheet2!C$113:$C169,1,0)","v":{"$error":"#N/A"}}]
["LCG00033",0,{"$f":"VLOOKUP(A18,Sheet2!C$113:$C173,1,0)","v":{"$error":"#N/A"}}]
["KADD0835",1,{"$f":"VLOOKUP(A19,Sheet2!C$113:$C174,1,0)","v":{"$error":"#N/A"}}]
["JG113837",1,{"$f":"VLOOKUP(A20,Sheet2!C$113:$C176,1,0)","v":{"$error":"#N/A"}}]
["LCG00006",0,{"$f":"VLOOKUP(A21,Sheet2!C$113:$C177,1,0)","v":{"$error":"#N/A"}}]
["JY113821",4,{"$f":"VLOOKUP(A22,Sheet2!C$113:$C178,1,0)","v":{"$error":"#N/A"}}]
["KACF0610",1,{"$f":"VLOOKUP(A23,Sheet2!C23:$C$113,1,0)","v":"KACF0610"}]
["KADD0612",1,{"$f":"VLOOKUP(A24,Sheet2!C28:$C$113,1,0)","v":"KADD0612"}]
["KCGD0606",1,{"$f":"VLOOKUP(A25,Sheet2!C32:$C$113,1,0)","v":"KCGD0606"}]
["LBU00045",2,{"$f":"VLOOKUP(A26,Sheet2!C$113:$C197,1,0)","v":{"$error":"#N/A"}}]
["JG561009",5,{"$f":"VLOOKUP(A27,Sheet2!C$113:$C198,1,0)","v":{"$error":"#N/A"}}]
["KADD0610",1,{"$f":"VLOOKUP(A28,Sheet2!C$113:$C199,1,0)","v":{"$error":"#N/A"}}]
["JG181250",1,{"$f":"VLOOKUP(A29,Sheet2!C$113:$C200,1,0)","v":{"$error":"#N/A"}}]
["LCG00029",1,{"$f":"VLOOKUP(A30,Sheet2!C70:$C$113,1,0)","v":"LCG00029"}]
["KADD0625",1,{"$f":"VLOOKUP(A31,Sheet2!C$113:$C205,1,0)","v":{"$error":"#N/A"}}]
["JG181255",1,{"$f":"VLOOKUP(A32,Sheet2!C$113:$C206,1,0)","v":{"$error":"#N/A"}}]
["LCL00002",1,{"$f":"VLOOKUP(A33,Sheet2!C$113:$C210,1,0)","v":{"$error":"#N/A"}}]
["KAED0622",1,{"$f":"VLOOKUP(A34,Sheet2!C$113:$C211,1,0)","v":{"$error":"#N/A"}}]
["KAED0616",1,{"$f":"VLOOKUP(A35,Sheet2!C$113:$C207,1,0)","v":{"$error":"#N/A"}}]
["KADF0618",0,{"$f":"VLOOKUP(A36,Sheet2!C$113:$C208,1,0)","v":{"$error":"#N/A"}}]
[39167504,0,{"$f":"VLOOKUP(A37,Sheet2!C$113:$C209,1,0)","v":{"$error":"#N/A"}}]
["KADD0814",1,{"$f":"VLOOKUP(A38,Sheet2!C$113:$C212,1,0)","v":{"$error":"#N/A"}}]
["KACA0616",1,{"$f":"VLOOKUP(A39,Sheet2!C99:$C$113,1,0)","v":{"$error":"#N/A"}}]
["LBU00060",0,{"$f":"VLOOKUP(A40,Sheet2!C100:$C$113,1,0)","v":{"$error":"#N/A"}}]
{"$rows_left_out":47}